Home > Unresolved External > Linker Error Lnk2019 Unresolved External Symbol

Linker Error Lnk2019 Unresolved External Symbol

Contents

Guide the OP to the solution, but do not solve it for them. Any help is appreciated. 8 commentsshareall 8 commentssorted by: besttopnewcontroversialoldrandomq&alive (beta)[–]Amarkov 0 points1 point2 points 2 years ago(3 children)What is the full text of the error message? There is further reading on template friends at cppreference and the C++ FAQ. share|improve this answer edited Mar 4 '14 at 0:13 answered Mar 3 '14 at 23:52 πάντα ῥεῖ 58.1k853111 2 Can't help but point out this question and the fact that Check This Out

an automated makefile) have been successfully removed. To use those symbols, you have to link against those object files. Join the conversation Toggle Main Navigation Log In Products Solutions Academia Support Community Events Contact Us How To Buy Contact Us How To Buy Log In Products Solutions Academia Support Community All rights reserved. /out:grasp.exe grasp.obj grasp.obj : error LNK2019: unresolved external symbol __imp_hx_connect referenced in function main grasp.obj : error LNK2019: unresolved external symbol __imp_hx_close referenced in function main grasp.obj : official site

Error Lnk2019 Unresolved External Symbol C++

I set up the compiler using mex -setup and was able to create and run some test MEX files.As I understand, I need to compile both helloworld.cpp and fdti.cpp when I Learn MATLAB today! Truth Stone: Effects on the justice system, and criminal world Advisor drops MSci student suddenly in final semester Why wasn't Peter Pettigrew bound with an Unbreakable Vow? If it is already, and I just didn't spot it, forget about this request/comment. –πάντα ῥεῖ Mar 3 '14 at 21:14 1 Pretty common mistake is that you define a

Finally, you are done! This can happen if the name in the calling code is misspelled, uses different capitalization, uses a different calling convention, or specifies different parameters.Code that uses C++ linkage uses Name Decoration, Neots, Cambridgeshire Top Re: link error in C example by fabienL » Wed Sep 16, 2015 9:21 am Hi Hitesh,thanks for your reply, I installed the 64-bit SDK version (my system Error Lnk2019 Unresolved External Symbol __declspec(dllimport) I want to learn to make video games.

Add a project-to-project reference to fix it.You build a console application by using settings for a Windows application. This documentation is archived and is not being maintained. In this case, you will want to repeat these steps for the other libraries. page permalinkembedsaveparentgive goldaboutblogaboutsource codeadvertisejobshelpsite rulesFAQwikireddiquettetransparencycontact usapps & toolsReddit for iPhoneReddit for Androidmobile websitebuttons<3reddit goldredditgiftsUse of this site constitutes acceptance of our User Agreement and Privacy Policy (updated). © 2016 reddit inc.

They also have the advantage of including both the mangled and unmangled names for the unresolved external. Error Lnk2019: Unresolved External Symbol "public: __thiscall With the functions you are testing located in another project, it's possible to build that project to either a dynamically or statically linked library. Automatic (function scope) variables can only be used in the scope of that function. All rights reserved. /out:grasp.exe grasp.obj mjhaptix_user.lib grasp.obj : error LNK2019: unresolved external symbol __imp__hx_connect referenced in function _main grasp.obj : error LNK2019: unresolved external symbol __imp__hx_close referenced in function _main grasp.obj

Error Lnk2019 Unresolved External Symbol Referenced In Function

I'm sure this is something stupid and simple I missed as well. https://www.reddit.com/r/learnprogramming/comments/2lt972/c_error_lnk2019_unresolved_external_symbol/ If the instrument driver that includes the functions is not already loaded into LabWindows/CVI, you will need to load it by going to Instrument»Load. Error Lnk2019 Unresolved External Symbol C++ If the linker can't find a matching definition for an external symbol in any of the linked files, it generates LNK2019.This error can occur if the object or library file that Error Lnk1120 If you're using MSVS, you'll see that projects generate .lib files.

wlorenz65, Jun 28, 2016 #6 Emo Todorov Administrator Staff Member In pursuit of user-friendliness, the Windows 10 update is automatic whether you want it or not! his comment is here stackoverflow.com/questions/32915615/… –Aleksey Kontsevich Oct 2 '15 at 21:02 | show 1 more comment up vote 97 down vote Class members: A pure virtual destructor needs an implementation. On the other hand, if there are 50 contacts silently sitting in a corner with constant contact forces, they don't need a small timestep. I will post an update soon. Lnk1120 1 Unresolved Externals

I was recently able to get rid of an unresolved external error in Visual Studio 2012 just by recompiling the offending file. Runnable means that someone should be able to take the code as is, compile and/or run it, and reproduce your problem. We appreciate your feedback. http://globalinfoindex.com/unresolved-external/linker-error-c-unresolved-external-symbol.php Should I replace with #include "../MyProjectTest/function.cpp" in file unittest.cpp? (I'm not good at english very much.

Newer Than: Search this thread only Search this forum only Display results as threads Useful Searches Recent Posts More... Error Lnk2019 Unresolved External Symbol _main Referenced In Function ___tmaincrtstartup I also had the same problem (with the same solution) for libxml2, libiconv and glew. That question is about a problem with Visual Studio's package management system, and my answer explains the reason and provides a workaround.

Under gcc you would specify all object files that are to be linked together in the command line, or compile the implementation files together.

Answered Your Question? 1 2 3 4 5 Document needs work? How to describe very damaging natural weapon attacks from a weak creature A tearful farewell Backdoor account in passwd file delete the numbers uniq -c created Vim: what are all the You then compile B, which will succeed and generate B.lib. Error Lnk2019 Unresolved External Symbol Void __cdecl I have added the header file using this path: project's Properties (in C/C++ -> General -> Additional Include Directories) Also i have linked the library using this path: Project Properties ->

If your project does not have a project-to-project reference, you may receive this linker error. I read in the internet and interested in the unit test, so I creat the test project: File > New > Project... > Installed > Templates > Visual C++ > Test Never give out complete solutions - help, guide, but do not solve! navigate here But they have to be valid for any system that can be represented in MuJoCo's modeling format.

It basically means that you compiled a bunch of implementation files into object files or libraries and now you want to get them to work together. Try to link $ g++ src1.o src2.o -o prog src2.o: In function `print()': src2.cpp:(.text+0x6): undefined reference to `local_var_name' collect2: error: ld returned 1 exit status It is happened because our local_var_name Our merchants keep turning into villains! Minimal means that it should be the smallest amount of code necessary to demonstrate your problem.

But we are hackers :) and we can fix it. code here This is my first time submitting so hopefully I've done it correctly. more hot questions question feed lang-c about us tour help blog chat data legal privacy policy work here advertising info mobile contact us feedback Technology Life / Arts Culture / Recreation Learning resources Microsoft Virtual Academy Channel 9 MSDN Magazine Community Forums Blogs Codeplex Support Self support Programs BizSpark (for startups) Microsoft Imagine (for students) United States (English) Newsletter Privacy & cookies