Home > Linker Error > Linker Errors Xcode

Linker Errors Xcode

Contents

What can I do about a rock climbing ban? Make sure that the Show Library Folder checkbox is checked. { 1 comment… read it below or add one } 1 Sander September 23, 2014 at 4:25 am Thanks! There should be lines at the end that say "Mach-O-Linker error: description of the error will be here". Am I right to think this homework problem on counting triangles in a grid is improperly set out? http://globalinfoindex.com/linker-error/linker-errors-in-ios.php

My boss asked asked if my colleague is underperforming If you are denied entry to a country at the airport, can you chose to fly to another destination? Related Questions iOS Building with IL2CPP universal Build causes tons of warnings 3 Answers Xcode error 90086 1 Answer How would I debug a Unity-plugin from XCode? 3 Answers Program received Sep 17 at 13:54 Have you copied ? –Mr Dipuna Sep 17 at 13:57 | show 4 more comments up vote 0 down vote UPDATE Xcode magically decided to The default location for DerivedData is: /Users/[your username]/Library/Developer/Xcode/DerivedData Wait! http://stackoverflow.com/questions/22032987/how-to-solve-mach-o-linker-error-in-ios7-xcode-5-0-1

Xcode Linker Error Undefined Symbols For Architecture X86_64

share|improve this answer edited May 23 '14 at 13:47 answered Mar 23 '14 at 11:12 MacMark 2,8062230 add a comment| up vote 0 down vote I suggest you to use xcode asked 3 years ago viewed 36277 times active 1 year ago Blog How Do Software Developers in New York, San Francisco, London and Bangalore… Linked 6 How to solve Mach-O-Linker error Why? –Linus G. How to professionally handle sexist remarks by a student?

Show more Language: English Content location: United States Restricted Mode: Off History Help Loading... Show 3 replies Re: Apple Mach-O Linker Error Level 1 (0 points) Eterick Stonely Aug 3, 2015 11:58 AM (in response to Bekx) This was a really finnicky error for me Thanks in advance. How To Solve Linker Error In Ios share|improve this answer edited Aug 27 '14 at 8:12 Valentina T 32 answered Feb 26 '14 at 6:56 Amar 11k43654 Arrrrg!

Sign in 6 Loading... How To Solve Linker Error In Xcode In Locations sub-tab you can see 'Derived Data' Click on arrow icon next to path. more stack exchange communities company blog Stack Exchange Inbox Reputation and Badges sign up log in tour help Tour Start here for a quick overview of the site Help Center Detailed The error in full is: "Framework not found AudioUnit Apple Mach-O Linker Error (null): Linker command failed with exit code 1 (use -v to see invocation)" I have audio unit added

Loading... Apple Mach-o Linker Error Xcode 7 ios swift xcode linker-error share|improve this question edited Sep 17 at 10:57 asked Sep 17 at 10:43 Linus G. 3,69851956 in project navigator , search for DownloadsViewController file .. Can someone take my Wi-Fi signal DOWN? Help!

How To Solve Linker Error In Xcode

https://github.com/rnystrom/RNBlurModalView/issues/5 Make sure you also have the QuartzCore framework included as well, as that is also required by that library.

Browse other questions tagged xcode apple game-center or ask your own question. Xcode Linker Error Undefined Symbols For Architecture X86_64 Brandon Brotsky 2,979 views 2:34 Xcode problem - Command /usr/bin/codesign failed with exit code 1 - Duration: 1:50. Xcode 8 Mach-o Linker Error It does not help by upgrading to Xcode 5.0.2 as your answer suggests.

Sign in to make your opinion count. his comment is here Our Company About Us Contact Us Community Treehouse Stories Student Perks Treehouse Blog Affiliate Program Careers Topics HTML CSS Design JavaScript Ruby PHP WordPress iOS Android Development Tools Business Tracks Web Sign in Email Address Password I forgot my password Sign in Unity Services Showcase Learn Community Asset Store Get Unity UNITY ACCOUNT You need a Unity Account to shop in the It should not be added to the UI application target. Xcode Linker Error Library Not Found

Using Promarker blender for copic Is it possible to have ONE Field that performs two separate functions (formulas) for two different Record Type Opportunities? Could you also ensure to include all the required frameworks? –user2071152 Feb 26 '14 at 6:04 Any body help me please.I am struck this one............ –user3222991 Feb 26 '14 Am I incorrect? http://globalinfoindex.com/linker-error/linker-errors-in-c.php All Aboard the Kolmogorov Complexity Train What is this game from this promotional image for joysticks?

If you still see linker errors, it may be that you are missing the -ObjC linker flag in your XCode project's build settings and need to add it back to the Apple Mach-o Linker Error Linker Command Failed With Exit Code 1 Search Home Getting Started Download & Integrate SDKs Advertising & Publishing FAQs & Troubleshooting Legal Terms and Conditions Privacy Policy Copyright © Chartboost and i am using Xcode 5 Hot Network Questions Why are the railings in Rivendell so low?

Now, the following errors came up: Error #1: Apple Mach-O Linker Error: Linker command failed with exit code 1 ld: file not found: /Users/Linus/Library/Developer/Xcode/DerivedData/MyApp-asdjeshhsetnfxbegcsbcipdreneewgr/Build/Intermediates/MyApp.build/Debug-iphonesimulator/MyApp.build/Objects-normal/x86_64/DownloadsViewController.o clang: error: linker command failed with exit

Not the answer you're looking for? This has gotten me in the past. Fixes my problem Leave a Comment Name * E-mail * Website Previous post: California court ruling: Employers need to provide some reimbursement for work-related use of personal mobile phones Next post: Apple Mach-o Linker (id) Error Ld /Users/murthych/Library/Developer/Xcode/DerivedData/ClassifiedDetails-elseirogpshyhmffphsiejgydphd/Build/Products/Debug-iphonesimulator/ClassifiedDetails.app/ClassifiedDetails normal i386 cd /Users/murthych/Desktop/ClassifiedDetails setenv IPHONEOS_DEPLOYMENT_TARGET 7.0 setenv PATH "/Applications/Xcode.app/Contents/Developer/Platforms/iPhoneSimulator.platform/Developer/usr/bin:/Applications/Xcode.app/Contents/Developer/usr/bin:/usr/bin:/bin:/usr/sbin:/sbin" /Applications/Xcode.app/Contents/Developer/Toolchains/XcodeDefault.xctoolchain/usr/bin/clang -arch i386 -isysroot /Applications/Xcode.app/Contents/Developer/Platforms/iPhoneSimulator.platform/Developer/SDKs/iPhoneSimulator7.0.sdk -L/Users/murthych/Library/Developer/Xcode/DerivedData/ClassifiedDetails-elseirogpshyhmffphsiejgydphd/Build/Products/Debug-iphonesimulator -F/Users/murthych/Library/Developer/Xcode/DerivedData/ClassifiedDetails-elseirogpshyhmffphsiejgydphd/Build/Products/Debug-iphonesimulator -F/Applications/Xcode.app/Contents/Developer/Library/Frameworks -filelist /Users/murthych/Library/Developer/Xcode/DerivedData/ClassifiedDetails-elseirogpshyhmffphsiejgydphd/Build/Intermediates/ClassifiedDetails.build/Debug-iphonesimulator/ClassifiedDetails.build/Objects-normal/i386/ClassifiedDetails.LinkFileList -Xlinker -objc_abi_version -Xlinker 2 -fobjc-arc -fobjc-link-runtime -Xlinker -no_implicit_dylibs -mios-simulator-version-min=7.0

Our merchants keep turning into villains! Transcript The interactive transcript could not be loaded. Browse other questions tagged ios swift xcode linker-error or ask your own question. http://globalinfoindex.com/linker-error/linker-errors.php I recently started working on an old project and it happened again!

I faced this issue with latest Xcode 5.0.2 as well. With Surface Dial and the Touch Bar, the battle for your non-dominant hand is heating up again No escape: The new MacBook Pro in the leaked photos apparently doesn’t have an Sign in 14 5 Don't like this video? Apple disclaims any and all liability for the acts, omissions and conduct of any third parties in connection with or related to your use of the site.

Thanks for your response. 3 Answers Jordan Winkelman 9,434 Points Jordan Winkelman Jordan Winkelman 9,434 Points almost 2 years ago I'm not sure if you still need an answer but I What if passport is lost and home country has no diplomatic presence? up vote 2 down vote favorite 1 I get this error: Undefined symbols for architecture i386: "_OBJC_CLASS_$_GameCenterManager", referenced from: objc-class-ref in BT_viewController.o ld: symbol(s) not found for architecture i386 clang: error: Undefined symbols for architecture i386: "_vImageBoxConvolve_ARGB8888", referenced from: -[UIImage(Blur) boxblurImageWithBlur:] in UIImage+Blur.o ld: symbol(s) not found for architecture i386 clang: error: linker command failed with exit code 1 (use -v to

Watch QueueQueueWatch QueueQueue Remove allDisconnect The next video is startingstop Loading... zzz2 zzz2 4,617 views 8:03 How to fix Unity Web Player Problem - Duration: 1:41. Linker errors of this nature are most frequently due to failing to link against the framework or library that provides a symbol you're using. Loading...

All Aboard the Kolmogorov Complexity Train What if passport is lost and home country has no diplomatic presence? I get Apple Mach-O-Linker error.I cant understand how to solve the issues.I am using xcode 5.0.1. Comment Add comment · Share 10 |3000 characters needed characters left characters exceeded ▼ Viewable by all users Viewable by moderators Viewable by moderators and the original poster Advanced visibility Viewable Customizing the Personalization Rules more hot questions question feed default about us tour help blog chat data legal privacy policy work here advertising info mobile contact us feedback Technology Life /

What I have found is when adding XCTest.framework Xcode adds extra \ to Framework Search Paths \"$(SDKROOT)/Developer/Library/Frameworks\" \"$(DEVELOPER_LIBRARY_DIR)/Frameworks\" $(DEVELOPER_FRAMEWORKS_DIR) This causes linker issue, ld: building for iOS Simulator, but linking against The swift file of DownloadsViewController is there, though. Karuna Karan 8,016 views 2:03 How To: Augmented Reality App Tutorial for Beginners with Vuforia and Unity 3D - Duration: 19:23. Movie about a man who becomes a genius because of a brain tumor?

Shortest code to produce non-deterministic output The Loose Astronaut How to tell if your flight has an air-bridge or stairs? Hopefully, it isn't as tedious for you as it was for me. Please type your message and try again. Loading...